BDBM50297686 2-(cyclohexyloxy)-4-(4-(methylsulfonyl)phenyl)-6-(trifluoromethyl)pyrimidine::CHEMBL552081
SMILES CS(=O)(=O)c1ccc(cc1)-c1cc(nc(OC2CCCCC2)n1)C(F)(F)F
InChI Key InChIKey=BURSRWZPRFNCOA-UHFFFAOYSA-N
Data  2 IC50
  Tab Delimited (TSV)   2D SDfile   Computed 3D by Vconf -m prep SDfile
Find this compound or compounds like it in BindingDB:
Activity Spreadsheet -- Enzyme Inhibition Constant Data from BindingDB
Found 1 hit for monomerid = 50297686
TargetProstaglandin G/H synthase 1(Homo sapiens (Human))
Glaxosmithkline
Curated by ChEMBL
LigandPNGBDBM50297686(2-(cyclohexyloxy)-4-(4-(methylsulfonyl)phenyl)-6-(...)
Affinity DataIC50:  1.86E+3nM. Assay description: Inhibition of human COX1 expressed in baculovirus-infected SF9 cells assessed as inhibition of arachidonic acid-stimulated PGE2 production treated 1 ...
In DepthDetails ArticlePubMed